{"text_format":"1","workbook":"xlsx","n_sheets":5,"sheets":["LB","Zeugnis","S","L","A"],"not_rendered":{"charts":0,"images":1,"macros":1,"external_links":0,"defined_names":172,"comments":0,"pivot_tables":0},"unopened":[],"bounds":{"document_bytes":16777216,"sheet_cells":100000,"rows_first":2000,"rows_last":500,"rows_between":2000,"halvings":0,"cell_chars":16384,"cell_head_chars":4096},"cells_cut":0,"cells_raw":0,"read":"whole","date_system":"1900"}

{"sheet":"LB","index":0,"n_rows":195,"n_cols":20,"rows_kept":195,"cut":false,"hidden":false,"merged":[[193,14,195,14],[10,14,12,14],[167,14,168,14],[148,14,149,14],[136,14,138,14],[97,14,99,14],[52,14,54,14],[59,14,61,14],[18,14,20,14],[38,14,40,14],[63,14,65,14],[129,4,129,7],[131,4,131,7],[133,4,133,7],[165,10,165,12],[167,10,167,12],[138,3,138,7],[135,3,135,7],[135,10,135,12],[164,10,164,12],[159,4,159,7],[162,2,162,12],[163,10,163,12],[167,3,167,7],[157,2,158,12],[168,10,168,12],[164,3,164,7],[61,10,61,12],[62,10,62,12],[154,4,154,7],[136,10,136,12],[138,10,138,12],[139,10,139,12],[97,10,97,12],[99,10,99,12],[100,10,100,12],[99,3,99,7],[118,2,118,12],[113,3,113,7],[113,10,113,12],[88,2,88,12],[91,2,91,12],[94,2,94,12],[96,10,96,12],[104,3,104,7],[127,2,127,12],[107,3,107,7],[107,10,107,12],[109,3,109,7],[109,10,109,12],[111,3,111,7],[121,2,121,12],[124,2,124,12],[115,3,115,7],[115,10,115,12],[59,2,59,12],[61,3,61,7],[96,3,96,7],[68,10,68,12],[70,10,70,12],[74,10,74,12],[76,10,76,12],[79,2,79,12],[82,2,82,12],[66,3,66,7],[68,3,68,7],[70,3,70,7],[72,3,72,7],[74,3,74,7],[76,3,76,7],[85,2,85,12],[50,3,50,7],[48,10,48,12],[12,3,12,7],[52,3,52,7],[54,3,54,7],[16,10,16,12],[18,3,18,12],[50,10,50,12],[25,2,25,12],[28,2,28,12],[31,2,31,12],[34,2,34,12],[37,2,37,12],[40,2,40,12],[44,3,44,7],[46,3,46,7],[48,3,48,7],[6,10,6,12],[12,10,12,12],[16,3,16,7],[20,3,20,7],[20,10,20,12],[6,3,6,7],[8,3,8,7],[10,3,10,7],[10,10,10,12]]}
[null,null,{"$f":"CONCATENATE(S_Typ,\" \",S_Verfasser)","v":" "},null,null,null,null,null,null,null,null,null,null,null,null,"Arbeit:",{"$f":"SUBSTITUTE(SUBSTITUTE(SUBSTITUTE(SUBSTITUTE(SUBSTITUTE(SUBSTITUTE(SUBSTITUTE(SUBSTITUTE(Dateiname0,\"ö\",\"oe\"),\"ä\",\"ae\"),\"ü\",\"ue\"),\"Ö\",\"Oe\"),\"Ä\",\"Ae\"),\"Ü\",\"Ue\"),\"é\",\"e\"),\"è\",\"e\")","v":"SA20____"}]
[null,null,null,null,null,null,null,null,null,null,null,null,null,null,null,null,{"$f":"CONCATENATE(A_Name,\"_\",UPPER(B_Kuerzel),\"_\",S_Name,\"_\",S_Vorname,\"_\",S_Klasse)","v":"SA20____"}]
[null,null,null,null,null,null,null,null,null,null,null,null,null,null,null,"Datei:"]
[]
[null,null,"1 Personalien (durch Verfasser auzufüllen)",null,null,null,null,null,null,null,null,"Termin:",{"$f":"T_Themenabgabe","v":"2019-12-13"},null,null,"Vollständig:",{"$f":"AND(Q7:Q13)","v":false}]
[]
[null,null,{"$f":"IF(S_Weiblich,\"Verfasserin:\",\"Verfasser:\")","v":"Verfasser:"},null,null,null,null,null,null,"Nr. EcoOpen:",{"$f":"IF($Q$7,VLOOKUP($S$7,S_Daten,2,FALSE),\"\")","v":""},null,null,null,null,"Auswahl:",{"$f":"NOT(ISERROR(VLOOKUP(D7,S!A:B,2,FALSE)))","v":false},"Nummer:",{"$f":"IF(Q7,VLOOKUP(D7,S!A:B,2,FALSE),\"\")","v":""}]
[]
[null,null,{"$f":"IF(S_Weiblich,\"Verfasserin Name:\",\"Verfasser Name:\")","v":"Verfasser Name:"},{"$f":"IF($Q$7,VLOOKUP($S$7,S_Daten,4,FALSE),\"\")","v":""},null,null,null,null,null,"Vorname:",{"$f":"IF($Q$7,VLOOKUP($S$7,S_Daten,5,FALSE),\"\")","v":""},"Klasse:",{"$f":"IF($Q$7,VLOOKUP($S$7,S_Daten,6,FALSE),\"\")","v":""},null,null,"Ausgefüllt:",{"$f":"AND(S_Name<>\"\",S_Vorname<>\"\",S_Klasse<>\"\")","v":false},"Weiblich:",{"$f":"IF(Q7,IF(VLOOKUP($S$7,S_Daten,14,FALSE)=\"w\",TRUE,FALSE),FALSE)","v":false}]
[]
[null,null,"Adresse:",{"$f":"IF($Q$7,VLOOKUP($S$7,S_Daten,7,FALSE),\"\")","v":""},null,null,null,null,null,"PLZ Ort:",{"$f":"IF($Q$7,CONCATENATE(VLOOKUP($S$7,S_Daten,8,FALSE),\" \",VLOOKUP($S$7,S_Daten,9,FALSE)),\"\")","v":""},null,null,null,{"$f":"IF(Q5,1,0)","v":0},"Ausgefüllt:",{"$f":"AND(S_Adresse<>\"\",S_Ort<>\"\")","v":false}]
[]
[null,null,"Telefon:",{"$f":"IF($Q$7,VLOOKUP($S$7,S_Daten,11,FALSE),\"\")","v":""},null,null,null,null,null,"Mailadresse:",{"$f":"IF($Q$7,VLOOKUP($S$7,S_Daten,13,FALSE),\"\")","v":""},null,null,null,null,"Ausgefüllt:",{"$f":"AND(S_Adresse<>\"\",S_Ort<>\"\")","v":false}]
[]
[null,null,"2 Allgemeine Angaben (durch Verfasser auszufüllen)",null,null,null,null,null,null,null,null,null,null,null,null,"Vollständig:",{"$f":"AND(Q17:Q21,S21)","v":false}]
[]
[null,null,"Typ:",null,null,null,null,null,null,"Fach:",null,null,null,null,null,"Ausgefüllt:",{"$f":"AND(S_Typ<>\"\",S_Richtung<>\"\")","v":false},{"$f":"IF(ISERROR(VLOOKUP(S_Typ,A!B3:D6,2,FALSE)),\"LEER\",VLOOKUP(S_Typ,A!B3:D6,2,FALSE))","v":"LEER"},{"$f":"VLOOKUP(S_Richtung,X_Richtung_Zeile,4,FALSE)","v":{"$error":"#N/A"}},{"$f":"IF(Q19,VLOOKUP(S_Fach,A_FachKuerzel,2,FALSE),\"\")","v":""}]
[]
[null,null,"Richtung:",null,null,null,null,null,null,null,null,null,null,null,{"$f":"IF(Q15,1,0)","v":0},"Ausgefüllt:",{"$f":"S_Fach<>\"\"","v":false}]
[]
[null,null,"Einzel-/Gruppenarb.:",null,null,null,null,null,null,{"$f":"IF(S_Einzel=\"Gruppenarbeit\",\"Grp.arbeit mit:\",\"\")","v":""},null,null,null,null,null,"Ausgefüllt:",{"$f":"S_Einzel<>\"\"","v":false},"Ausgefüllt:",{"$f":"NOT(AND(S_Einzel=\"Gruppenarbeit\",S_GrpMit=\"\"))","v":true}]
[]
[null,null,"3 Themenvorschlag (durch Verfasser auszufüllen)",null,null,null,null,null,null,null,null,null,null,null,null,"Vollständig:",{"$f":"AND(Q26:Q35)","v":false}]
[]
[null,null,"Arbeitstitel:"]
[null,null,null,null,null,null,null,null,null,null,null,null,null,null,null,"Ausgefüllt:",{"$f":"S_Arbeitstitel<>\"\"","v":false}]
[]
[null,null,"Mögliche Leitfragen: (Fragen, die ich mit meiner Arbeit beantworten möchte)"]
[null,null,null,null,null,null,null,null,null,null,null,null,null,null,null,"Ausgefüllt:",{"$f":"S_Leitfragen<>\"\"","v":false}]
[]
[null,null,"Eigenleistung:"]
[null,null,null,null,null,null,null,null,null,null,null,null,null,null,null,"Ausgefüllt:",{"$f":"S_Eigenleistung<>\"\"","v":false}]
[]
[null,null,"Persönliche Motivation: (persönlicher Bezug, Erfahrungshintergrund, vorhandene und angestrebte Kenntnisse)"]
[null,null,null,null,null,null,null,null,null,null,null,null,null,null,null,"Ausgefüllt:",{"$f":"S_Motivation<>\"\"","v":false}]
[]
[null,null,"Thema wurde abgesprochen mit:"]
[null,null,null,null,null,null,null,null,null,null,null,null,null,null,null,"Ausgefüllt:",{"$f":"S_Absprache<>\"\"","v":false}]
[null,null,null,null,null,null,null,null,null,null,null,null,null,null,{"$f":"IF(Q23,1,0)","v":0}]
[null,null,{"$f":"IF(S_Einzel=\"Gruppenarbeit\",\"Begründung für Gruppenarbeit:\",\"Bemerkungen\")","v":"Bemerkungen"}]
[]
[]
[null,null,"4 Entscheid Fachschaft (durch die Fachschaft auszufüllen)",null,null,null,null,null,null,null,null,"Termin:",{"$f":"T_ZuweisungBetKor","v":"2020-01-17"},null,null,"Vollständig:",{"$f":"AND(Q45:Q53)","v":false}]
[]
[null,null,{"$f":"IF(B_Weiblich,\"Berteuerin:\",\"Betreuer:\")","v":"Betreuer:"},null,null,null,null,null,null,null,null,null,null,null,null,"Auswahl:",{"$f":"NOT(ISERROR(VLOOKUP(D45,L!A:B,2,FALSE)))","v":false},"Nummer:",{"$f":"IF(Q45,VLOOKUP(D45,L!A:B,2,FALSE),\"\")","v":""}]
[]
[null,null,{"$f":"IF(B_Weiblich,\"Betreuerin Name:\",\"Betreuer Name:\")","v":"Betreuer Name:"},{"$f":"IF($Q$45,VLOOKUP($S$45,L_Daten,3,FALSE),\"\")","v":""},null,null,null,null,null,"Vorname:",{"$f":"IF($Q$45,VLOOKUP($S$45,L_Daten,4,FALSE),\"\")","v":""},"Kürzel:",{"$f":"UPPER(IF($Q$45,VLOOKUP($S$45,L_Daten,5,FALSE),\"\"))","v":""},null,null,"Ausgefüllt:",{"$f":"AND(B_Name<>\"\",B_Vorname<>\"\",B_Kuerzel<>\"\")","v":false},"Weiblich:",{"$f":"IF(Q45,IF(VLOOKUP($S$45,L_Daten,15,FALSE)=\"w\",TRUE,FALSE),FALSE)","v":false}]
[]
[null,null,"Adresse:",{"$f":"IF($Q$45,VLOOKUP($S$45,L_Daten,6,FALSE),\"\")","v":""},null,null,null,null,null,"PLZ Ort:",{"$f":"IF($Q$45,CONCATENATE(VLOOKUP($S$45,L_Daten,7,FALSE),\" \",VLOOKUP($S$45,L_Daten,8,FALSE)),\"\")","v":""},null,null,null,null,"Ausgefüllt:",{"$f":"AND(B_Adresse<>\"\",B_Ort<>\"\")","v":false}]
[]
[null,null,"Telefon:",{"$f":"IF($Q$45,VLOOKUP($S$45,L_Daten,12,FALSE),\"\")","v":""},null,null,null,null,null,"Mailadresse:",{"$f":"IF($Q$45,VLOOKUP($S$45,L_Daten,14,FALSE),\"\")","v":""},null,null,null,null,"Ausgefüllt:",{"$f":"AND(B_Telefon<>\"\",B_Mail<>\"\")","v":false}]
[]
[null,null,{"$f":"IF(K_Weiblich,\"Korreferentin:\",\"Korreferent:\")","v":"Korreferent:"},null,null,null,null,null,null,null,null,null,null,null,{"$f":"IF(Q43,1,0)","v":0},"Auswahl:",{"$f":"NOT(ISERROR(VLOOKUP(K_Korreferent,L!A:B,2,FALSE)))","v":false},"Nummer:",{"$f":"IF(Q53,VLOOKUP(D53,L!A:B,2,FALSE),\"\")","v":""}]
[]
[null,null,{"$f":"IF(K_Weiblich,\"Korreferentin Name:\",\"Korreferent Name:\")","v":"Korreferent Name:"},{"$f":"IF($Q$53,VLOOKUP($S$53,L_Daten,3,FALSE),\"\")","v":""},null,null,null,null,null,"Vorname:",{"$f":"IF($Q$53,VLOOKUP($S$53,L_Daten,4,FALSE),\"\")","v":""},"Kürzel:",{"$f":"UPPER(IF($Q$53,VLOOKUP($S$53,L_Daten,5,FALSE),\"\"))","v":""},null,null,"Ausgefüllt:",{"$f":"AND(K_Name<>\"\",K_Vorname<>\"\",K_Kuerzel<>\"\")","v":false},"Weiblich:",{"$f":"IF(Q53,IF(VLOOKUP($S$53,L_Daten,15,FALSE)=\"w\",TRUE,FALSE),FALSE)","v":false}]
[null,null,null,null,null,null,null,null,null,null,{"$f":"IF($Q$53,VLOOKUP($S$53,L_Daten,14,FALSE),\"\")","v":""}]
[null,null,"5 Entscheid Schulleitung (durch die Schulleitung auszufüllen)",null,null,null,null,null,null,null,null,"Termin:",{"$f":"T_BewilligungSL","v":"2020-01-18"},null,null,"Vollständig:",{"$f":"AND(Q60:Q62)","v":false}]
[]
[null,null,"Entscheid:"]
[null,null,null,null,null,null,null,null,null,null,null,null,null,null,{"$f":"IF(Q57,1,0)","v":0},"Ausgefüllt:",{"$f":"SL_Entscheid<>\"\"","v":false}]
{"$rows_left_out":136}
{"sheet":"Zeugnis","index":1,"n_rows":31,"n_cols":7,"rows_kept":31,"cut":false,"hidden":false,"merged":[[12,1,12,7]]}
[]
[]
[null,{"$f":"S_Typ","v":0}]
[null,{"$f":"CONCATENATE(\"der \",VLOOKUP(S_Typ_Abkuerzung,A!C3:D6,2,FALSE),\" Sursee\")","v":"der Kantonsschule Sursee"}]
[]
[null,{"$f":"CONCATENATE(\"Die \",VLOOKUP(S_Typ_Abkuerzung,A!C3:D6,2,FALSE),\" Sursee bestätigt:\")","v":"Die Kantonsschule Sursee bestätigt:"}]
[]
[null,{"$f":"CONCATENATE(S_Name,\" \",S_Vorname)","v":" "}]
[null,{"$f":"CONCATENATE(\"Klasse \",S_Klasse2)","v":"Klasse "}]
[]
[null,{"$f":"CONCATENATE(\"hat im Fach \",S_Fach,\" zum Thema\")","v":"hat im Fach  zum Thema"}]
[]
[null,{"$f":"N_Titel","v":0}]
[]
[null,{"$f":"CONCATENATE(\"die \",S_Typ,\" verfasst und folgende Bewertung erhalten:\")","v":"die  verfasst und folgende Bewertung erhalten:"}]
[]
[null,"Bewertung",null,null,"Gewicht",null,"Note"]
[]
[null,"Produkt",null,{"$f":"N_Text1","v":""},{"$f":"N_Gewicht1","v":""},null,{"$f":"N_Note1","v":0}]
[null,null,null,{"$f":"N_Text2","v":""},{"$f":"N_Gewicht2","v":""},null,{"$f":"N_Note2","v":0}]
[null,null,null,{"$f":"N_Text3","v":"Prozess:"},{"$f":"N_Gewicht3","v":""},null,{"$f":"N_Note3","v":0}]
[null,"Präsentation",null,null,{"$f":"N_Gewicht4","v":""},null,{"$f":"N_Note4","v":0}]
[null,"Schlussnote",null,null,null,null,{"$f":"N_Note5","v":""}]
[]
[null,{"$f":"A_Datum1","v":"00:00:00"}]
[]
[null,{"$f":"IF(B_Weiblich,\"Referentin\",\"Referent\")","v":"Referent"},null,null,{"$f":"IF(K_Weiblich,\"Korreferentin\",\"Korreferent\")","v":"Korreferent"}]
[]
[]
[]
[null,{"$f":"CONCATENATE(B_Name,\" \",B_Vorname)","v":" "},null,null,{"$f":"CONCATENATE(K_Name,\" \",K_Vorname)","v":" "}]

{"sheet":"S","index":2,"n_rows":78,"n_cols":15,"rows_kept":78,"cut":false,"hidden":true,"merged":[]}
[]
[]
[]
[]
[]
[]
[]
[]
[]
[]
[]
[]
[]
[]
[]
[]
[]
[]
[]
[]
[]
[]
[]
[]
[]
[]
[]
[]
[]
[null,null,"PARTNER","AGS_PREFIX","PAR_NAME","PAR_VORNAME","Klasse","PAR_ADRESSE","PAR_PLZ","PAR_ORT","PAR_GEBURTSDATUM","Tel_P","Natel","Email","Gesch"]
[{"$f":"CONCATENATE(E31,\" \",F31,\" \",G31)","v":"Birrer Maureen F2a"},1,408657,"F2","Birrer","Maureen","F2a","Eichenweg 24","6212","St. Erhard","2002-07-16","041-920 14 44","079-300 69 34","Maureen_Birrer@sluz.ch","w"]
[{"$f":"CONCATENATE(E32,\" \",F32,\" \",G32)","v":"Blum Kyra F2b"},{"$f":"B31+1","v":2},409801,"F2","Blum","Kyra","F2b","Dorfstrasse 71","6265","Roggliswil","2003-12-10","079-781 32 21",null,"Kyra_Blum@sluz.ch","w"]
[{"$f":"CONCATENATE(E33,\" \",F33,\" \",G33)","v":"Blümli Julia F2b"},{"$f":"B32+1","v":3},409803,"F2","Blümli","Julia","F2b","Grütstrasse 3","6244","Nebikon","2003-05-26","062-756 54 74","079-514 13 48","Julia_Bluemli@sluz.ch","w"]
["Brechbühl Aline F2b",4,409805,"F2","Brechbühl","Aline","F2b","Hubel 6","6212","St. Erhard","2002-12-19","041-921 03 08","076-251 19 12","Aline_Brechbuehl@sluz.ch","w"]
["Brunner Markus F2b",5,409807,"F2","Brunner","Markus","F2b","Spittelhof 43","4806","Wikon","2002-11-14","062-751 54 07","077-40017 67","Markus_Brunner1@sluz.ch","m"]
["Bucher Lena F2b",6,409844,"F2","Bucher","Lena","F2b","Dorfstrasse 17","6214","Schenkon","2002-03-16","041-921 03 82","079-601 16 12","Lena_Bucher@sluz.ch","w"]
["Bühlmann Alina F2b",7,410483,"F2","Bühlmann","Alina","F2b","Mitterain 28","6234","Triengen","2002-10-16","076-489 99 77",null,"Alina_Buehlmann@sluz.ch","w"]
["Bühlmann Tina F2a",8,410082,"F2","Bühlmann","Tina","F2a","Zihl 3","6204","Sempach","2002-02-15","041-460 47 72","079-158 65 00","Tina_Buehlmann@sluz.ch","w"]
["Ciancio Angelo F2b",9,409650,"F2","Ciancio","Angelo","F2b","Heugärtenweg 6","6232","Geuensee","2002-10-16","041-281 52 71","076-563 59 79","Angelo_Ciancio@sluz.ch","m"]
["Dähler Anna F2a",10,408719,"F2","Dähler","Anna","F2a","Buchwaldweg 5","6207","Nottwil","2003-03-04","041-937 28 55","076-476 07 77","Anna_Daehler@sluz.ch","w"]
["Dervisoska Jasmina F2a",11,410103,"F2","Dervisoska","Jasmina","F2a","Rotbachweg 12","6152","Hüswil","2003-05-10","041-988 13 81","079-944 77 29","Jasmina_Dervisoska@sluz.ch","w"]
["Erni Cyril F2b",12,410105,"F2","Erni","Cyril","F2b","Lischenweg 3","4915","St. Urban","2003-04-27","062-530 66 67","079-301 29 22","Cyril_Erni@sluz.ch","m"]
["Erni Salome F2a",13,409810,"F2","Erni","Salome","F2a","Grünenbodenstrasse 29","6144","Zell LU","2003-01-03","041-970 03 02","079-191 00 23","Salome_Erni1@sluz.ch","w"]
["Fajardo Richell F2b",14,410583,"F2","Fajardo","Richell","F2b","Schachenmatt 7","6133","Hergiswil LU","2003-06-22","041-979 01 61","079-120 65 92","Richell_Fajardo1@sluz.ch","w"]
["Gehrlach Marlen F2b",15,409812,"F2","Gehrlach","Marlen","F2b","Längenmoosstrasse 2","6233","Büron","2001-10-13","041-934 00 36","076-471 48 60","Marlen_Gehrlach@sluz.ch","w"]
["Gerber Eliane F2a",16,410615,"F2","Gerber","Eliane","F2a","Feldstrasse 20","6022","Grosswangen","2003-03-16","041-980 30 27","079-873 67 30","Eliane_Gerber@sluz.ch","w"]
["Giger Sabrina F2b",17,409813,"F2","Giger","Sabrina","F2b","Dorfstrasse 12","6263","Richenthal","2003-05-18","062-758 41 38","079-694 61 68","Sabrina_Giger@sluz.ch","w"]
["Graweid Tanisha F2b",18,409815,"F2","Graweid","Tanisha","F2b","Flurweg 2","6262","Langnau b. Reiden","2003-02-27","062-758 43 92","076-802 88 55","Tanisha_Graweid@sluz.ch","w"]
["Greber Elaine F2a",19,409438,"F2","Greber","Elaine","F2a","Bahnhofstrasse 37","6210","Sursee","2002-10-21","041-921 20 10",null,"Elaine_Greber@sluz.ch","w"]
["Hamurtekin Hilal F2b",20,410097,"F2","Hamurtekin","Hilal","F2b","Dörnliacher 5","6232","Geuensee","2002-11-23","041-920 25 82","079-275 06 32","Hilal_Hamurtekin@sluz.ch","w"]
["Hodel Lynne F2a",21,409396,"F2","Hodel","Lynne","F2a","Osterweg 6","6210","Sursee","2002-06-11","041-921 52 74","079-275 17 99","Lynne_Hodel@sluz.ch","w"]
["Kirchhofer Laura F2a",22,409817,"F2","Kirchhofer","Laura","F2a","Wesmeristrasse 5","6221","Rickenbach LU","2003-02-03","041-467 07 22","076-812 37 66","laura_kirchhofer@sluz.ch","w"]
["Kostic Julia F2a",23,410087,"F2","Kostic","Julia","F2a","Haldenstrasse 9","6130","Willisau","2002-07-12","041-970 25 67","079-929 79 82","Julia_Kostic@sluz.ch","w"]
["Krienbühl Lynne F2a",24,409821,"F2","Krienbühl","Lynne","F2a","Hintertannberg 3","6214","Schenkon","2003-10-16","041-921 77 47","077-497 48 22","Lynne_Krienbuehl@sluz.ch","w"]
["Lütolf Lea F2a",25,408514,"F2","Lütolf","Lea","F2a","Föhrenhof","6242","Wauwil","2002-11-22","041-980 39 78","077-463 76 60","Lea_Luetolf@sluz.ch","w"]
["Meier Ilaria F2b",26,409823,"F2","Meier","Ilaria","F2b","Rosenweg 11","6210","Sursee","2002-04-17","041-921 71 94","076-583 04 17","Ilaria_Meier@sluz.ch","w"]
["Meier Kim F2b",27,410111,"F2","Meier","Kim","F2b","Feldheimstrasse 39","6260","Reiden","2004-03-19","062-758 33 18",null,"Kim_Meier@sluz.ch","w"]
["Meier Lisa F2a",28,409825,"F2","Meier","Lisa","F2a","Schwyzermatt 11","6130","Willisau","2003-05-01","041-970 46 61","079-235 65 44","Lisa_Meier@sluz.ch","w"]
["Müller Lisa F2a",29,410092,"F2","Müller","Lisa","F2a","Engelbergstrasse 12","6243","Egolzwil","2003-05-20","041-982 00 07","076-400 20 53","Lisa_Mueller@sluz.ch","w"]
["Panduri Simona F2a",30,408717,"F2","Panduri","Simona","F2a","Burgacher 7","6207","Nottwil","2002-05-29","041-938 05 55","078-625 31 11","Simona_Panduri@sluz.ch","w"]
{"$rows_left_out":19}
{"sheet":"L","index":3,"n_rows":152,"n_cols":16,"rows_kept":152,"cut":false,"hidden":true,"merged":[]}
[]
[]
[]
[]
[]
[]
[]
[]
[]
[]
[]
[]
[]
[]
[]
[]
[]
[]
[]
[]
[]
[]
[]
[]
[]
[]
[]
[]
[]
[null,null,"partner","par_name","par_vorname","mapa_abkurzung","par_adresse","par_plz","par_ort","anrede","par_beruf","par_geburtsdatum","Tel_P","Natel","Email","Gesch"]
[{"$f":"CONCATENATE(D31,\" \",E31)","v":"Amico Flavia"},1,410598,"Amico","Flavia","ami","Unter-Geissenstein 8","6005","Luzern","Fr","M Sc Education","1987-11-14","076-530 06 63",null,null,"w"]
[{"$f":"CONCATENATE(D32,\" \",E32)","v":"Arnet Matthias"},{"$f":"B31+1","v":2},403661,"Arnet","Matthias","arn","Erlenstr. 29","6020","Emmenbrücke","Hr","lic. phil. I","1966-10-03","041-280 33 52","077-429 50 67","matthias.arnet@edulu.ch","m"]
[{"$f":"CONCATENATE(D33,\" \",E33)","v":"Balmer Evelyne"},{"$f":"B32+1","v":3},173,"Balmer","Evelyne","bae","Rankhof 8","6208","Oberkirch LU","Fr","dipl.Turn- u. Sportlehrerin II","1973-12-16","041-920 27 85","079-583 57 38","evelyne.balmer@edulu.ch","w"]
["Baschung Franziska",4,405656,"Baschung","Franziska","bas","Fläckepark 1","6023","Rothenburg","Fr","dipl.Turn- u. Sportlehrerin II","1978-10-09","041-544 16 88","078-882 44 62","franziska.baschung@edulu.ch","w"]
["Baumgartner Mirjam",5,193,"Baumgartner","Mirjam","bau","Chäppelimatte 6","6262","Langnau b. Reiden","Fr","Hauswirtschaftslehrerin","1959-10-08","062-758 21 71","079-383 69 74","mirjam.baumgartner@edulu.ch","w"]
["Bechtold Toni Amadeus",6,408482,"Bechtold","Toni Amadeus","bec","Elfenaustrasse 36","6005","Luzern","Hr","Lehrdiplom Klarinette, Saxofon","1986-04-16","077-436 99 02",null,"Toni.Bechtold@edulu.ch","m"]
["Beltrani Marco",7,409273,"Beltrani","Marco","bel","Müllheimerstrasse 54","4057","Basel","Hr","MA Musikpädagogik","1988-03-12","079-543 81 60",null,"marco.beltrani@edulu.ch","m"]
["Berger Hutchings Monika",8,404791,"Berger Hutchings","Monika","bem","Holzacherstr. 12","6210","Sursee","Fr","lic. phil. I","1960-07-06","041-921 42 32","078-919 35 85","monika.berger@edulu.ch","w"]
["Biland Susanna",9,404792,"Biland","Susanna","bil","Rainacher 21","6243","Egolzwil","Fr","lic. phil. I","1974-04-09","041-980 01 90","079-616 71 20","susanna.biland@edulu.ch","w"]
["Blättler Benno",10,140,"Blättler","Benno","bla","Rüti 4","6026","Rain","Hr","dipl. Turnlehrer ETH","1969-06-28","041-448 35 86","079-465 42 01","benno.blaettler@edulu.ch","m"]
["Blum Michael",11,405194,"Blum","Michael","blu","Rebgasse 16","4432","Lampenberg","Hr","lic. phil. I","1962-08-25","061-951 20 17","076-375 58 21","michael.blum1@edulu.ch","m"]
["Bregnard Thierry",12,187,"Bregnard","Thierry","brg","Dornirain 1","6047","Kastanienbaum","Hr","Dr. sc. nat. ETH","1964-12-26","041-361 01 72","076-530 01 72","thierry.bregnard@edulu.ch","m"]
["Brentini Fabrizio",13,132,"Brentini","Fabrizio","bre","Dreilindenstr. 75d","6006","Luzern","Hr","Dr. phil. I, lic. theol.","1957-03-13","041-422 09 90","078-805 71 71","fabrizio.brentini@edulu.ch","m"]
["Broder Barbara",14,410586,"Broder","Barbara","bro","Schauensee 11","6204","Sempach","Fr","dipl. Zeichen- u. Werklehrerin","1982-10-11","041-461 03 49","078-610 65 63",null,"w"]
["Brücker Marcel",15,8,"Brücker","Marcel","xbru","Wilemattstrasse 15","6210","Sursee","Hr","lic.phil.I","1951-02-13","041-921 50 38","079-228 17 60",null,"m"]
["Bründler Stadler Ursula",16,85,"Bründler Stadler","Ursula","brn","Kaspar Koppstr. 79","6030","Ebikon","Fr","lic. phil. I","1961-10-21","041-422 05 20","078-707 05 21","ursula.bruendler@edulu.ch","w"]
["Brunner Céline",17,410170,"Brunner","Céline","bru","Kapellenstrasse 31","3011","Bern","Fr",null,"1994-06-22","079-545 76 67",null,null,"w"]
["Büchel Adrian",18,191,"Büchel","Adrian","bua","Rigiweg 2","6033","Buchrain","Hr","lic. phil. I","1968-03-09","041-420 07 91","079-429 99 71","adrian.buechel@edulu.ch","m"]
["Bucher Stefan",19,69,"Bucher","Stefan","bst","Waldstr. 5/21","6015","Luzern","Hr","Lehrdiplom Klavier","1959-08-03","041-260 64 32","077-449 31 21","stefan.bucher@edulu.ch","m"]
["Budmiger Samuel",20,407214,"Budmiger","Samuel","bud","Surengasse 26","6210","Sursee","Hr","M Sc Geschichte und Deutsch","1984-02-22","076-417 87 58",null,"samuel.budmiger@edulu.ch","m"]
["Bühlmann Stephan",21,404448,"Bühlmann","Stephan","buh","Alpenstrasse 20","6210","Sursee","Hr","Lehrdiplom Horn","1967-10-04","041-920 47 00","076-490 41 91","stephan.buehlmann@edulu.ch","m"]
["Burkard Nicole",22,405652,"Burkard","Nicole","bur","Mayenfelserstrasse 3","4133","Pratteln","Fr","lic. phil. I","1974-11-03","061-321 22 08","076-459 41 55","nicole.burkard@edulu.ch","w"]
["Callmar Roland",23,403675,"Callmar","Roland","cal","Hohlgasse 14","6233","Büron","Hr","Lehrdiplom Trompete","1963-07-21","041-934 00 25","079-340 64 75","roland.callmar@edulu.ch","m"]
["Casparis Claudine",24,407216,"Casparis","Claudine","cas","Neuhusstrasse 4","6045","Meggen","Fr","dipl.Turn- u. Sportlehrerin II","1980-02-02","041-410 06 40","078-775 07 33","claudine.casparis@edulu.ch","w"]
["Chiantese Stefano",25,406058,"Chiantese","Stefano","chi","Birkenstrasse 3","5742","Kölliken","Hr","Dr. rer. nat., dipl. phys.","1969-11-22","062-822 54 01","077-438 72 59","stefano.chiantese@edulu.ch","m"]
["Clemens Thomas",26,405653,"Clemens","Thomas","cle","Leonhardsgraben 53/55","4051","Basel","Hr","lic. phil.","1970-08-02","076-394 55 37",null,"thomas.clemens@edulu.ch","m"]
["Conrardy Richard",27,410587,"Conrardy","Richard","con","Moschtiweg 2","6213","Knutwil","Hr","M Sc Mathematik","1988-05-18","076-472 71 58",null,null,"m"]
["D'Incau Renato",28,410132,"D'Incau","Renato","din","Rebgasse 68","4058","Basel","Hr","M Sc PS","1982-05-29","076-548 15 61",null,"renato.dincau@edulu.ch","m"]
["Deeg Stefan",29,172,"Deeg","Stefan","dee","Muracher 7","6235","Winikon","Hr","lic. phil. I","1962-05-01","041-933 01 42","079-872 74 15","stefan.deeg@edulu.ch","m"]
["Disler Severin",30,11,"Disler","Severin","dis","Schützenmatte 2c","6214","Schenkon","Hr","lic. phil. nat.","1961-03-19","041-921 62 70","076-431 02 38","severin.disler@edulu.ch","m"]
{"$rows_left_out":93}
{"sheet":"A","index":4,"n_rows":91,"n_cols":78,"rows_kept":91,"cut":false,"hidden":true,"merged":[]}
["Name:","SA20"]
[]
["Typ:","Maturaarbeit","MA","Kantonsschule","6","Prorektor Oberstufe","S. Deeg"]
[null,"Selbständige Arbeit","SA","Fachmittelschule","F3","Prorektor FMS","M. Zihlmann"]
[null,"Fachmaturitätsarbeit","FA","Fachmittelschule","F4","Prorektor FMS","M. Zihlmann"]
[null,"0","LEER","Kantonsschule",null," "," "]
[]
["Einzel/Grp.:","Einzelarbeit"]
[null,"Gruppenarbeit"]
[]
[null,null,null,null,null,"MA",null,null,null,null,"SA",null,null,null,null,"FA",null,null,null,null,"LEER"]
[null,null,null,null,null,"MA_Gew1","MA_Gew2","MA_Gew3","MA_Gew4",null,"SA_Gew1","SA_Gew2","SA_Gew3","SA_Gew4",null,"FA_Gew1","FA_Gew2","FA_Gew3","FA_Gew4",null,"LEER_Gew1","LEER_Gew2","LEER_Gew3","LEER_Gew4"]
["Richtung:","Textzentrierte Arbeit","Inhalt:","Formales:",2,0.5,0.2,0.05,0.25,{"$f":"SUM(F13:I13)","v":1},0.5,0.2,0.05,0.25,{"$f":"SUM(K13:N13)","v":1},0.45,0.15,0.05,0.35,{"$f":"SUM(P13:S13)","v":1}]
[null,"naturwissenschaftliche Arbeit","Inhalt:","Formales:",3,0.5,0.2,0.05,0.25,1,0.5,0.2,0.05,0.25,1,0.45,0.15,0.05,0.35,1]
[null,"mathematische Arbeit","Inhalt:","Formales:",4,0.5,0.2,0.05,0.25,1,0.5,0.2,0.05,0.25,1,0.45,0.15,0.05,0.35,1]
[null,"Fremdsprache","Inhalt:","Sprache und Formales:",5,0.35,0.35,0.05,0.25,1,0.35,0.35,0.05,0.25,1,0.3,0.3,0.05,0.35,1]
[null,"musisch-kreative oder praktische Arbeit mit grossem Werkanteil (nur in DE, BG und MU möglich)","Werk:","Schriftlicher Kommentar:",6,0.5,0.2,0.05,0.25,1,0.5,0.2,0.05,0.25,1,0.45,0.15,0.05,0.35,1]
[null,"musisch-kreative oder praktische Arbeit mit kleinerem Werkanteil (nur in DE, ES, MU und SP möglich)","Werk:","Schriftlicher Kommentar:",7,0.35,0.35,0.05,0.25,1,0.35,0.35,0.05,0.25,1,0.3,0.3,0.05,0.35,1]
[]
["Fach:","Bildnerisches Gestalten","BG"]
[null,"Biologie","BI"]
[null,"Chemie","CH"]
[null,"Deutsch","DE"]
[null,"Englisch","EN"]
[null,"Französich","FR"]
[null,"Geografie","GG"]
[null,"Geschichte","GS"]
[null,"Informatik","IN"]
[null,"Italienisch","IT"]
[null,"Latein","LA"]
[null,"Mathematik","MA"]
[null,"Musik","MU"]
[null,"Philosophie","PH"]
[null,"Pädagogik/Psychologie","PP"]
[null,"Physik","PS"]
[null,"Religion","RE"]
[null,"Spanisch","ES"]
[null,"Sport","SP"]
[null,"Wirtschaft und Recht","WR"]
[null,"Anderes Fach","-"]
[]
["Zeitplan:","eingehalten"]
[null,"wenig im Rückstand"]
[null,"stark im Rückstand"]
[]
["Weiterarbeit:","gemäss Plan"]
[null,"gemäss Abmachung"]
[null,"neue Zielsetzung"]
[]
["Bewertung:","ungenügend"]
[null,"genügend"]
[null,"gut"]
[null,"sehr gut"]
[]
["Auszeichung:","nein"]
[null,"ja"]
[]
["Termine:","Orientierung","Woche vom / am","2019-10-14"]
[null,"Marktplatz","Woche vom / am",""]
[null,"Präsentation Bes.","Woche vom / am","2020-03-09"]
{"$rows_left_out":31}